{"text_format":"1","workbook":"xlsx","n_sheets":20,"sheets":["Introduction","General Info","Facilities Inventory","CMP Overview","Budgets","PM","Health & Safety","Integrated Pest Management","Indoor Environment Quality","Energy","Current Projects","Planned Projects","Facility Report Card","5 Year Cap Plan, Part 1","5 Year Cap Plan, Part 2","App A Equip Inventory","App B PM Checklist & Log","App C Work Order","App D Bid Spec","App E Resources"],"not_rendered":{"charts":0,"images":1,"macros":1,"external_links":1,"defined_names":51,"comments":0,"pivot_tables":0},"unopened":[],"bounds":{"document_bytes":16777216,"sheet_cells":100000,"rows_first":2000,"rows_last":500,"rows_between":2000,"halvings":0,"cell_chars":16384,"cell_head_chars":4096},"cells_cut":0,"cells_raw":0,"read":"whole","date_system":"1900"}

{"sheet":"Introduction","index":0,"n_rows":26,"n_cols":1,"rows_kept":26,"cut":false,"hidden":false,"merged":[[0,0,0,3],[1,0,1,3],[3,0,3,3],[4,0,4,3],[21,0,21,3],[19,0,19,3],[15,0,15,3],[5,0,5,3],[2,0,2,3],[23,0,23,3],[24,0,24,3],[26,0,31,3],[22,0,22,3],[25,0,25,3],[6,0,6,3],[9,0,9,3],[7,0,7,3],[18,0,18,3],[14,0,14,3],[13,0,13,3],[16,0,16,3],[10,0,10,3],[12,0,12,3],[8,0,8,3],[11,0,11,3],[17,0,17,3]]}
["ATTENTION!"]
["IF YOU SEE THIS, YOU HAVE MACROS DISABLED OR RESTRICTED"]
[]
["PLEASE ENABLE MACROS FOR THIS TOOLBOX TO FUNCTION PROPERLY"]
["TO DO THIS, CLICK ON \"TOOLS\" IN THE MENU ABOVE, FIND THE OPTION \"MACRO\", DRAG YOUR CURSOR OVER IT, THEN CLICK \"SECURITY\""]
["UNDER THE SECURITY LEVEL TAB, CLICK THE OPTION FOR \"MEDIUM\" LEVEL SECURITY, THEN CLOSE AND RELOAD THIS FILE"]
["Energy $mart Schools"]
["NYSED Capital & Maintenance Planning Reports Toolbox"]
{"$rows_left_out":19}
{"sheet":"General Info","index":1,"n_rows":17,"n_cols":4,"rows_kept":17,"cut":false,"hidden":false,"merged":[[0,0,0,3],[16,0,16,3],[2,0,2,3],[4,0,4,3],[3,0,3,3],[5,0,5,3],[15,0,15,3]]}
["In addition to being an input page, this page also serves as the cover page for the CMP."]
[]
["Energy $mart Schools"]
["Comprehensive Maintenance Plan (CMP)"]
["GENERAL INFORMATION"]
[]
["Date:","2005-02-01","Person Preparing this Plan: ","John Doe"]
["School District:","Sample Town CSD","Title/Position","Superintendent of Buildings and Grounds"]
{"$rows_left_out":10}
{"sheet":"Facilities Inventory","index":2,"n_rows":60,"n_cols":7,"rows_kept":60,"cut":false,"hidden":false,"merged":[[59,1,59,6],[53,0,53,6],[54,1,54,6],[55,1,55,6],[56,1,56,6],[1,0,1,6],[0,0,0,6],[2,0,2,6],[57,1,57,6],[58,1,58,6]]}
["Energy $mart Schools"]
[{"$f":"CONCATENATE(\"District: \",'General Info'!B8, \"           Prepared by: \",'General Info'!D7, \"           Date: \",TEXT('General Info'!B7,\"mm/dd/yyyy\"))","v":"District: Sample Town CSD           Prepared by: John Doe           Date: 02/01/2005"}]
["FACILITIES INVENTORY"]
["Name of School/Facility","Elementary Elementary School","Good Grades Middle School","Example School 3","Example School 4","Example School 5","Example School 6"]
["BEDS Code",123456789,987654321]
["Street Address","1234 Willow Road","9 Chain Road"]
["City","Sacketts Harbor","Albany"]
["State","NY","NY"]
{"$rows_left_out":53}
{"sheet":"CMP Overview","index":3,"n_rows":27,"n_cols":7,"rows_kept":27,"cut":false,"hidden":false,"merged":[[26,0,26,5],[25,3,25,5],[20,0,20,1],[19,3,19,5],[22,3,22,5],[21,3,21,5],[25,0,25,1],[24,3,24,5],[23,3,23,5],[19,0,19,1],[17,0,17,6],[5,0,5,6],[13,0,13,6],[11,1,11,6],[14,0,14,4],[15,0,15,2],[0,0,0,6],[16,0,16,6],[6,1,6,6],[12,1,12,6],[7,1,7,6],[8,1,8,6],[9,1,9,6],[10,1,10,6],[2,0,2,6],[3,0,3,6],[4,0,4,6],[24,0,24,1],[20,3,20,5],[23,0,23,1],[22,0,22,1],[21,0,21,1]]}
["Provide a detailed description of the maintained conditions for each school building in the District compared to a year ago.  Use information from the yearly Visual Inspections and the original Building Condition Survey Reports to help track the progress being made.  This is also a good place to highlight items such as: how persistent problems have been solved; energy-efficiency projects being implemented; and new approaches being taken (e.g., trying new computerized maintenance management software)."]
[]
["Energy $mart Schools"]
[{"$f":"CONCATENATE(\"District: \",'General Info'!B8, \"           Prepared by: \",'General Info'!D7, \"           Date: \",TEXT('General Info'!B7,\"mm/dd/yyyy\"))","v":"District: Sample Town CSD           Prepared by: John Doe           Date: 02/01/2005"}]
["OVERVIEW"]
["Summary of Overall Conditions"]
["School Name","General Conditions and Goals"]
[{"$f":"'Facilities Inventory'!B4","v":"Elementary Elementary School"},"Insert assessment here…"]
{"$rows_left_out":20}
{"sheet":"Budgets","index":4,"n_rows":114,"n_cols":7,"rows_kept":114,"cut":false,"hidden":false,"merged":[[0,0,0,6],[19,0,19,6],[20,1,20,2],[20,3,20,4],[20,5,20,6],[2,0,2,6],[3,0,3,6],[4,0,4,6],[5,5,5,6],[5,1,5,2],[5,3,5,4],[51,0,51,6],[52,1,52,2],[52,3,52,4],[52,5,52,6],[35,0,35,6],[36,1,36,2],[36,3,36,4],[36,5,36,6],[99,0,99,6],[100,1,100,2],[100,3,100,4],[100,5,100,6],[67,0,67,6],[68,1,68,2],[68,3,68,4],[68,5,68,6],[83,0,83,6],[84,1,84,2],[84,3,84,4],[84,5,84,6]]}
["Use these tables to document the estimated budget costs to 1) restore buildings to a state of good repair, 2) keep buildings in a state of good repair, and 3) project O&M costs. This material will become part of the annual Facility Report Card and will help justify annual maintenance expenses. The table at the top is the DISTRICT SUMMARY.  Dollar values entered in the school level tables below the District Summary will automatically total in the District Summary Table."]
[]
["Energy $mart Schools"]
[{"$f":"CONCATENATE(\"District: \",'General Info'!B8, \"           Prepared by: \",'General Info'!D7, \"           Date: \",TEXT('General Info'!B7,\"mm/dd/yyyy\"))","v":"District: Sample Town CSD           Prepared by: John Doe           Date: 02/01/2005"}]
["DISTRICT LEVEL BUDGET SUMMARY"]
[null,"Estimated Costs to Restore Buildings to a State of Good Repair",null,"Estimated Annual Costs to Keep Buildings in a State of Good Repair",null,"Projected Budget for O&M Costs"]
["Element","Cost Estimate","Notes","Cost Estimate","Notes","Cost Estimate","Notes"]
["Site Elements",{"$f":"+B23+B39+B55+B71+B87+B103","v":11000},null,{"$f":"+D23+D39+D55+D71+D87+D103","v":2000},null,{"$f":"+F23+F39+F55+F71+F87+F103","v":3000}]
{"$rows_left_out":107}
{"sheet":"PM","index":5,"n_rows":21,"n_cols":1,"rows_kept":21,"cut":false,"hidden":false,"merged":[[18,0,18,3],[17,0,17,3],[1,0,1,3],[0,0,0,3],[20,0,20,3],[2,0,2,3],[13,0,13,3],[16,0,16,3],[19,0,19,3],[14,0,14,3],[15,0,15,3]]}
["Energy $mart Schools"]
[{"$f":"CONCATENATE(\"District: \",'General Info'!B8, \"           Prepared by: \",'General Info'!D7, \"           Date: \",TEXT('General Info'!B7,\"mm/dd/yyyy\"))","v":"District: Sample Town CSD           Prepared by: John Doe           Date: 02/01/2005"}]
["PREVENTIVE MAINTENANCE PLAN"]
[]
["Preventive Maintenance (PM) typically provides significant benefits such as:"]
[]
["·        Lower overall maintenance costs versus correcting problems after they occur;"]
["·        Reduce equipment down time;"]
{"$rows_left_out":14}
{"sheet":"Health & Safety","index":6,"n_rows":40,"n_cols":7,"rows_kept":40,"cut":false,"hidden":false,"merged":[[0,0,0,6],[38,1,38,6],[39,1,39,6],[33,1,33,6],[34,1,34,6],[35,1,35,6],[36,1,36,6],[37,1,37,6],[21,0,21,6],[9,0,9,2],[4,1,4,2],[3,1,3,2],[5,1,5,2],[20,1,20,2],[6,1,6,2],[7,1,7,2],[1,0,1,6],[18,1,18,2],[19,1,19,2],[11,1,11,2],[12,1,12,2],[13,1,13,2],[16,1,16,2],[10,1,10,2],[15,0,15,2],[2,0,2,6],[8,1,8,2],[14,1,14,2],[17,1,17,2]]}
["Energy $mart Schools"]
[{"$f":"CONCATENATE(\"District: \",'General Info'!B8, \"           Prepared by: \",'General Info'!D7, \"           Date: \",TEXT('General Info'!B7,\"mm/dd/yyyy\"))","v":"District: Sample Town CSD           Prepared by: John Doe           Date: 02/01/2005"}]
["HEALTH & SAFETY"]
["Description of Health and Safety Committee activities:","Yes/No"]
["Does the district have a health and safety committee?","Yes"]
["Does the Health and Safety Committee have a chairperson?","No"]
["  - Name","John Milton"]
["  - Phone Number","212-867-5309"]
{"$rows_left_out":33}
{"sheet":"Integrated Pest Management","index":7,"n_rows":11,"n_cols":7,"rows_kept":11,"cut":false,"hidden":false,"merged":[[0,0,0,6],[2,0,2,6],[3,0,3,6],[4,0,4,6]]}
["Indicate below which measures have been taken to achieve acceptable Integrated Pest Management."]
[]
["Energy $mart Schools"]
[{"$f":"CONCATENATE(\"District: \",'General Info'!B8, \"           Prepared by: \",'General Info'!D7, \"           Date: \",TEXT('General Info'!B7,\"mm/dd/yyyy\"))","v":"District: Sample Town CSD           Prepared by: John Doe           Date: 02/01/2005"}]
["INTEGRATED PEST MANAGEMENT"]
["SCHOOL/FACILITY:",{"$f":"'Facilities Inventory'!B4","v":"Elementary Elementary School"},{"$f":"'Facilities Inventory'!C4","v":"Good Grades Middle School"},{"$f":"'Facilities Inventory'!D4","v":"Example School 3"},{"$f":"'Facilities Inventory'!E4","v":"Example School 4"},{"$f":"'Facilities Inventory'!F4","v":"Example School 5"},{"$f":"'Facilities Inventory'!G4","v":"Example School 6"}]
["Status of measures to assure acceptable integrated pest management: ","Yes/No","Yes/No","Yes/No","Yes/No","Yes/No","Yes/No"]
["Does this building have an Integrated Pest Management program? See Appendix B.","Yes","Yes"]
{"$rows_left_out":4}
{"sheet":"Indoor Environment Quality","index":8,"n_rows":35,"n_cols":7,"rows_kept":35,"cut":false,"hidden":false,"merged":[[21,1,21,6],[15,1,15,6],[16,1,16,6],[17,1,17,6],[18,1,18,6],[19,1,19,6],[2,0,2,6],[0,0,0,6],[4,0,4,6],[3,0,3,6],[20,1,20,6]]}
["Use this table to provide information for your District’s School Facility Report Cards and the CMP.  Complete for each building in the District, and both a District-summary table and individual Report Card sections will be produced."]
[]
["Energy $mart Schools"]
[{"$f":"CONCATENATE(\"District: \",'General Info'!B8, \"           Prepared by: \",'General Info'!D7, \"           Date: \",TEXT('General Info'!B7,\"mm/dd/yyyy\"))","v":"District: Sample Town CSD           Prepared by: John Doe           Date: 02/01/2005"}]
["INDOOR ENVIRONMENTAL QUALITY"]
["SCHOOL/FACILITY:",{"$f":"'Facilities Inventory'!B4","v":"Elementary Elementary School"},{"$f":"'Facilities Inventory'!C4","v":"Good Grades Middle School"},{"$f":"'Facilities Inventory'!D4","v":"Example School 3"},{"$f":"'Facilities Inventory'!E4","v":"Example School 4"},{"$f":"'Facilities Inventory'!F4","v":"Example School 5"},{"$f":"'Facilities Inventory'!G4","v":"Example School 6"}]
["Status of actions and policies taken to assure acceptable indoor environmental quality:","Yes/No","Yes/No","Yes/No","Yes/No","Yes/No","Yes/No"]
["Does this building use the US Environmental Protection Agency’s Indoor Air Quality Tools for Schools Action Kit?","Yes","No"]
{"$rows_left_out":28}
{"sheet":"Energy","index":9,"n_rows":23,"n_cols":13,"rows_kept":23,"cut":false,"hidden":false,"merged":[[22,3,22,4],[22,1,22,2],[22,11,22,12],[22,9,22,10],[22,7,22,8],[22,5,22,6],[19,9,19,10],[20,9,20,10],[17,11,17,12],[18,11,18,12],[19,11,19,12],[20,11,20,12],[19,5,19,6],[20,5,20,6],[17,7,17,8],[18,7,18,8],[19,7,19,8],[20,7,20,8],[19,1,19,2],[20,1,20,2],[17,3,17,4],[18,3,18,4],[19,3,19,4],[20,3,20,4],[17,1,17,2],[18,1,18,2],[17,5,17,6],[18,5,18,6],[17,9,17,10],[18,9,18,10],[14,11,14,12],[14,9,14,10],[16,11,16,12],[16,1,16,2],[15,1,15,2],[15,9,15,10],[16,3,16,4],[16,5,16,6],[16,7,16,8],[16,9,16,10],[15,11,15,12],[15,3,15,4],[15,5,15,6],[15,7,15,8],[13,9,13,10],[13,11,13,12],[10,1,10,2],[10,3,10,4],[10,5,10,6],[12,0,12,12],[13,1,13,2],[13,3,13,4],[13,5,13,6],[13,7,13,8],[0,0,0,12],[5,9,5,10],[11,11,11,12],[10,7,10,8],[8,11,8,12],[9,9,9,10],[9,11,9,12],[10,9,10,10],[9,7,9,8],[10,11,10,12],[2,0,2,12],[3,0,3,12],[5,11,5,12],[4,0,4,12],[5,1,5,2],[5,3,5,4],[11,9,11,10],[5,5,5,6],[5,7,5,8],[11,5,11,6],[11,7,11,8],[8,9,8,10],[8,5,8,6],[8,7,8,8],[9,5,9,6],[14,7,14,8],[8,1,8,2],[8,3,8,4],[9,1,9,2],[9,3,9,4],[14,1,14,2],[14,3,14,4],[14,5,14,6],[11,1,11,2],[11,3,11,4],[21,9,21,10],[21,11,21,12],[21,1,21,2],[21,3,21,4],[21,5,21,6],[21,7,21,8]]}
["Use this table to record your District’s energy benchmarking score compared to other New York schools.  Complete for each building in the District.  See Appendix E, Best Practices for additional information the US EPA Energy Star Portfolio Manager and the New York State Energy Research and Development Authority (NYSERDA) Energy Smart Schools Program free energy benchmarking service. "]
[]
["Energy $mart Schools"]
[{"$f":"CONCATENATE(\"District: \",'General Info'!B8, \"           Prepared by: \",'General Info'!D7, \"           Date: \",TEXT('General Info'!B7,\"mm/dd/yyyy\"))","v":"District: Sample Town CSD           Prepared by: John Doe           Date: 02/01/2005"}]
["ENERGY BENCHMARKING"]
["SCHOOL/FACILITY:",{"$f":"'Facilities Inventory'!B4","v":"Elementary Elementary School"},null,{"$f":"'Facilities Inventory'!C4","v":"Good Grades Middle School"},null,{"$f":"'Facilities Inventory'!D4","v":"Example School 3"},null,{"$f":"'Facilities Inventory'!E4","v":"Example School 4"},null,{"$f":"'Facilities Inventory'!F4","v":"Example School 5"},null,{"$f":"'Facilities Inventory'!G4","v":"Example School 6"}]
["Status of measures taken to optimize energy use: ","Current Year","Last Year","Current Year","Last Year","Current Year","Last Year","Current Year","Last Year","Current Year","Last Year","Current Year","Last Year"]
["What was this building’s score in the U.S. Environmental Protection Agency’s Energy Star® Portfolio Manager?",60,50,60,50]
{"$rows_left_out":16}
{"sheet":"Current Projects","index":10,"n_rows":23,"n_cols":6,"rows_kept":23,"cut":false,"hidden":false,"merged":[[21,1,21,2],[5,1,5,2],[6,1,6,2],[17,1,17,2],[18,1,18,2],[19,1,19,2],[20,1,20,2],[4,0,4,5],[2,0,2,5],[3,0,3,5],[0,0,0,5]]}
["Use this table to demonstrate the benefits of the major projects implementing in the District. Explain how major repairs, replacements, and energy-efficiency upgrades: reduce energy costs; reduce unnecessary repair/replacement costs by keeping equipment operating properly (life extension); improve occupant comfort, health, and indoor environmental quality; and reduce maintenance costs by replacing/upgrading equipment that requires frequent attention."]
[]
["Energy $mart Schools"]
[{"$f":"CONCATENATE(\"District: \",'General Info'!B8, \"           Prepared by: \",'General Info'!D7, \"           Date: \",TEXT('General Info'!B7,\"mm/dd/yyyy\"))","v":"District: Sample Town CSD           Prepared by: John Doe           Date: 02/01/2005"}]
["MAJOR PROJECTS DURING LAST YEAR"]
["SED # (if applicable)","Brief Project Description",null,"Project Dates","Costs","Project Benefits"]
["SED #00-00-00-00-0-000","Example: New Boiler Controls",null,"5/5/03 to 9/5/03",120000,"Reduce energy costs $150/year, eliminate frequent repairs."]
[]
{"$rows_left_out":16}
{"sheet":"Planned Projects","index":11,"n_rows":12,"n_cols":11,"rows_kept":12,"cut":false,"hidden":false,"merged":[[0,0,0,10],[2,0,2,10],[3,0,3,10],[4,0,4,10]]}
["In the table below, list all capital projects anticipated over the next five years. In the last column, indicate the benefits of the capital projects for the CMP by describing how they will lower energy costs, decrease annual service-and-repair costs, or improve life/health/safety conditions."]
[]
["Energy $mart Schools"]
[{"$f":"CONCATENATE(\"District: \",'General Info'!B8, \"           Prepared by: \",'General Info'!D7, \"           Date: \",TEXT('General Info'!B7,\"mm/dd/yyyy\"))","v":"District: Sample Town CSD           Prepared by: John Doe           Date: 02/01/2005"}]
["PLANNED CAPITAL PROJECTS"]
[" Facility Name","SED Number","Project Description","Year","Priority","Construction Type","Project Type","Funding Source","Cost","Annual Benefits","Notes"]
["Elementary Elementary School",43305439053,"New RTUs",2,1,"New Construction","Major System","Capital",30000]
["Elementary Elementary School",121212121234124,"New Windows",5,3,"Addition","Health/Safety","Capital",20000]
{"$rows_left_out":5}
{"sheet":"Facility Report Card","index":12,"n_rows":117,"n_cols":7,"rows_kept":117,"cut":false,"hidden":false,"merged":[[115,1,115,4],[38,5,38,6],[40,5,40,6],[41,1,41,2],[113,2,113,4],[97,0,97,4],[95,1,95,4],[96,1,96,4],[108,1,108,4],[109,1,109,4],[69,1,69,3],[38,1,38,2],[38,3,38,4],[59,0,59,6],[39,1,39,2],[39,3,39,4],[102,2,102,4],[93,1,93,4],[87,1,87,4],[88,1,88,4],[80,1,80,4],[98,1,98,4],[99,1,99,4],[100,1,100,4],[101,2,101,4],[79,1,79,4],[103,2,103,4],[114,2,114,4],[106,2,107,6],[105,1,105,4],[112,2,112,4],[111,1,111,4],[104,2,104,4],[110,1,110,4],[94,1,94,4],[0,0,0,6],[4,4,4,5],[92,0,92,4],[6,4,6,6],[14,1,14,2],[89,1,89,2],[90,2,91,6],[78,1,78,4],[37,1,37,2],[37,3,37,4],[37,5,37,6],[39,5,39,6],[82,1,82,4],[83,1,83,4],[86,1,86,4],[2,0,2,6],[7,2,7,4],[4,1,4,2],[5,1,5,6],[7,0,7,1],[6,1,6,2],[9,0,9,6],[36,3,36,6],[12,1,12,2],[44,1,44,2],[44,3,44,4],[44,5,44,6],[43,1,43,2],[42,3,42,4],[42,5,42,6],[42,1,42,2],[27,0,27,6],[35,3,35,6],[49,1,49,2],[13,1,13,2],[21,0,21,6],[29,1,30,6],[34,3,34,6],[41,5,41,6],[40,1,40,2],[40,3,40,4],[47,3,47,4],[47,5,47,6],[48,1,48,2],[48,3,48,4],[48,5,48,6],[116,1,116,4],[41,3,41,4],[49,3,49,4],[49,5,49,6],[43,3,43,4],[43,5,43,6],[45,1,45,2],[45,3,45,4],[45,5,45,6],[46,1,46,2],[46,3,46,4],[46,5,46,6],[50,1,50,2],[50,3,50,4],[50,5,50,6],[47,1,47,2]]}
["Instructions: Click on the yellow highlighted area, then use the drop-down menu to select the building name.  The form will fill itself out automatically. "]
[]
["School Facility Report Card"]
[]
["School District/BOCES:",{"$f":"'General Info'!B8","v":"Sample Town CSD"},null,"Building Name:","Example School 6",null,"<< Select to change school"]
["School Building Address:",{"$f":"CONCATENATE(HLOOKUP($E$5,'Facilities Inventory'!$A$4:$G$16,3,FALSE)&\" -- \"& HLOOKUP($E$5,'Facilities Inventory'!$A$4:$G$16,4,FALSE)&\", \"&HLOOKUP($E$5,'Facilities Inventory'!$A$4:$G$16,5,FALSE)&\" \"&HLOOKUP($E$5,'Facilities Inventory'!$A$4:$G$16,6,FALSE))","v":" -- ,  "}]
["Certificate of Occupancy Status:",{"$f":"HLOOKUP($E$5,'Facilities Inventory'!$A$19:$G$28,2,FALSE)","v":0},null,"Expiration Date:",{"$f":"HLOOKUP($E$5,'Facilities Inventory'!$A$19:$G$28,3,FALSE)","v":"00:00:00"}]
["Location where certificate of occupancy is posted:",null,{"$f":"HLOOKUP($E$5,'Facilities Inventory'!$A$19:$G$28,4,FALSE)","v":0}]
{"$rows_left_out":110}
{"sheet":"5 Year Cap Plan, Part 1","index":13,"n_rows":158,"n_cols":8,"rows_kept":158,"cut":false,"hidden":false,"merged":[[134,0,134,7],[92,0,92,7],[113,3,113,4],[114,1,114,2],[115,1,115,2],[123,1,123,2],[98,1,98,6],[117,1,117,2],[118,1,118,2],[119,1,119,2],[85,0,85,1],[88,0,88,1],[85,2,87,7],[82,0,82,1],[19,0,19,7],[40,0,40,7],[43,0,43,7],[67,0,67,7],[69,0,69,7],[70,0,70,7],[73,0,73,1],[76,0,76,1],[79,0,79,1],[120,1,120,2],[116,1,116,2],[116,3,116,4],[114,3,114,4],[115,3,115,4],[117,3,117,4],[118,3,118,4],[119,3,119,4],[120,3,120,4],[121,3,121,4],[122,3,122,4],[123,3,123,4],[124,3,124,4],[122,1,122,2],[121,1,121,2],[124,1,124,2],[0,0,0,7],[8,0,8,7],[9,0,9,7],[39,0,39,7],[113,1,113,2],[88,2,90,7],[72,0,72,1],[71,0,71,7],[2,0,2,7],[73,2,75,7],[76,2,78,7],[79,2,81,7],[96,0,96,1],[96,2,96,5],[82,2,84,7],[94,2,94,5]]}
["This tab is used to print parts of the 5-Year Capital Facilities Plan. You do not need to enter any data here. You can preview or print this tab, however, if you want to see how this material will look in the final Capital Plan Report."]
[]
[]
[]
[]
[]
[]
[]
{"$rows_left_out":151}
{"sheet":"5 Year Cap Plan, Part 2","index":14,"n_rows":22,"n_cols":13,"rows_kept":22,"cut":false,"hidden":false,"merged":[[1,0,1,12],[0,0,0,12],[2,0,2,12]]}
["Instructions: If you want to view or print capital data for a single school, click the dropdown button to fill in data for one school. You do not need to enter any data on this form because it is brought in from other tabs."]
["Facility Estimated Expenses"]
[]
["District:",null,{"$f":"'General Info'!B8","v":"Sample Town CSD"}]
["Facility Name:",null,"Example School 6","<< select to change school"]
[null,null,null,null,"New Construction","Addition","Alterations","Major System","Major Repair","Energy","Bond","Capital"]
["Year 1","Priority","SED #","Item Description",null,null,null,null,null,null,null,null,"Cost"]
[]
{"$rows_left_out":15}
{"sheet":"App A Equip Inventory","index":15,"n_rows":204,"n_cols":16,"rows_kept":204,"cut":false,"hidden":false,"merged":[[0,0,0,12],[4,0,4,15],[1,0,1,15],[2,0,2,15],[3,0,3,15]]}
["You can use the following Equipment Inventory to help start your PM system. This page helps you keep track of all your equipment and matches the equipment on the following PM Log page. You can expand the table as needed by adding rows.  BE SURE TO COPY THE TAB AS NEEDED FOR EACH SCHOOL. "]
["Energy $mart Schools"]
["Comprehensive Maintenance Plan (CMP)"]
[{"$f":"CONCATENATE(\"District: \",'General Info'!B8, \"           Prepared by: \",'General Info'!D7, \"           Date: \",TEXT('General Info'!B7,\"mm/dd/yyyy\"))","v":"District: Sample Town CSD           Prepared by: John Doe           Date: 02/01/2005"}]
["Equipment Inventory"]
["School: ________________________________",null,null,"Date Updated: ____________________________"]
[]
["Heating Systems","P.M. Ref #","Manufacturer","Model #","Serial #","Size","Fuel Type","Efficiency Rating","Number in Building","Installation Date","Expected Service Life (yrs)","Location","Suggested Maint Interval (# per year)","Special Tools Required","Annual Maintenance Cost ($)","Notes"]
{"$rows_left_out":197}
{"sheet":"App B PM Checklist & Log","index":16,"n_rows":207,"n_cols":16,"rows_kept":207,"cut":false,"hidden":false,"merged":[[0,0,0,15],[4,0,4,15],[1,0,1,15],[2,0,2,15],[3,0,3,15]]}
["Use the following checklist and log to help keep track of your PM activities and to demonstrate the proper maintenance you perform in each building in your District. This will also help justify your expenses for PM and your capital expenses for equipment that has had proper maintenance over the years.  Check the appropriate box to indicate the month that each PM action was accomplished.  The table will expand as needed.  BE SURE TO COPY THE TAB AS NEEDED FOR EACH SCHOOL."]
["Energy $mart Schools"]
["Comprehensive Maintenance Plan (CMP)"]
[{"$f":"CONCATENATE(\"District: \",'General Info'!B8, \"           Prepared by: \",'General Info'!D7, \"           Date: \",TEXT('General Info'!B7,\"mm/dd/yyyy\"))","v":"District: Sample Town CSD           Prepared by: John Doe           Date: 02/01/2005"}]
["PM Checklist and Log"]
["School: ____________________________________",null,"Year: ________________",null,"Implementor Key: M = Maintenance Mechanic   C = Custodian/on-site staff    G = Grounds crew    CC = Contracted to others"]
[]
["Heating Systems","P.M. Ref #","Implementor","Frequency/Year","Jan","Feb","Mar","Apr","May","Jun","Jul","Aug","Sep","Oct","Nov","Dec"]
{"$rows_left_out":200}
{"sheet":"App C Work Order","index":17,"n_rows":59,"n_cols":13,"rows_kept":59,"cut":false,"hidden":false,"merged":[[1,0,1,17],[0,0,0,16],[2,0,2,16]]}
["This template can be used to help you customize a different PM work order for each PM activity listed on the PM Checklist and Log. Under the \"Description of Work to be Performed,\" you can list the PM steps necessary for the specific PM interval for that specific equipment.  You can save a copy of this form and edit as needed for each piece of equipment for which you perform PM services."]
["Preventive Maintenance Work Order Sheet"]
[]
["Equipment to be Worked on:"]
[]
["School District:",null,null,null,null,null,null,null,"Date Issued:"]
[]
["School:",null,null,null,null,null,null,null,"Date Completed:"]
{"$rows_left_out":52}
{"sheet":"App D Bid Spec","index":18,"n_rows":39,"n_cols":2,"rows_kept":39,"cut":false,"hidden":false,"merged":[[0,0,0,12],[3,1,3,12],[18,1,18,12],[1,0,1,12],[2,0,2,12]]}
["This sample language can be used as part of a bid specification to help guide contractors in providing adequate documentation and training that will lead to better O&M in your schools."]
["O&M Specification Language "]
[]
["A.","Operation and Maintenance Instructions:  Arrange for each Installer of equipment that requires regular maintenance to meet with the Owner's personnel to provide instruction in proper operation and maintenance of the installed equipment.  Provide instruction by manufacturer's representatives if installers are not experienced in operation and maintenance procedures.  Include a detailed review of the following items:"]
[]
[1,"Maintenance manuals."]
[2,"Record documents."]
[3,"Spare parts and materials."]
{"$rows_left_out":32}
{"sheet":"App E Resources","index":19,"n_rows":15,"n_cols":1,"rows_kept":15,"cut":false,"hidden":false,"merged":[[0,0,0,11],[3,0,3,10],[1,0,1,11],[11,0,11,10],[9,0,9,10],[7,0,7,10],[5,0,5,10],[2,0,2,11]]}
["Following are available resources for applying recognized best practices in your schools:"]
["Best Practices Guides and Resources"]
[]
["US Environmental Protection Agency (EPA) Indoor Air Quality Tools for Schools Action Kit is available by calling 1-800-438-4318 or online at www.epa.gov/iaq/schools/toolkit.html ."]
[]
["US EPA Integrated Pest Management (IPM) in Schools resources are available online at www.epa.gov/pesticides/ipm/index.htm . The popular EPA booklet, \"Pest Control in the School Environment: Adopting IPM\" is designed to encourage and assist school officials in examining and improving their pest management practices. It identifies ways to reduce the use of pesticides in school buildings and landscapes, as well as alternative methods of managing pests commonly found in schools. A copy of the booklet may be obtained on-line by contacting the National Service Center for Environmental Publications , or by phone at 1-800-490-9198. The EPA publication number is EPA 735-F-93-012."]
[]
["US EPA Energy Star Portfolio Manager and the New York State Energy Research and Development Authority (NYSERDA) Energy Smart Schools Program free energy benchmarking service is available by calling 1-866-NYSERDA."]
{"$rows_left_out":7}